Added libboost-all-dev cpack dependency

2 jobs for 1.0.0 in 1 minute and 3 seconds (queued for 1 second)
Status Job ID Name Coverage
  Build
failed #6323
build-package

00:01:03

 
  Deploy
skipped #6324
update_repo
 
Name Stage Failure
failed
build-package Build
make[2]: *** Waiting for unfinished jobs....
make[2]: *** [src/CMakeFiles/dynamixel.dir/dynamixel.o] Error 1
src/CMakeFiles/dynamixel.dir/build.make:110: recipe for target 'src/CMakeFiles/dynamixel.dir/dynamixelserver_ftdi.o' failed
src/CMakeFiles/dynamixel.dir/build.make:62: recipe for target 'src/CMakeFiles/dynamixel.dir/dynamixel.o' failed
CMakeFiles/Makefile2:186: recipe for target 'src/CMakeFiles/dynamixel.dir/all' failed
make[1]: *** [src/CMakeFiles/dynamixel.dir/all] Error 2
make: *** [all] Error 2
Makefile:149: recipe for target 'all' failed
ERROR: Job failed: exit code 1